{"text_format":"1","workbook":"xlsx","n_sheets":7,"sheets":["Cover Sheet","0. Worked example","Sheet1","1. Budget Calculator","2. Modelling data inputs","3. Current budget data","Sensitivity data"],"not_rendered":{"charts":0,"images":9,"macros":1,"external_links":0,"defined_names":6,"comments":3,"pivot_tables":0},"unopened":[],"bounds":{"document_bytes":16777216,"sheet_cells":100000,"rows_first":2000,"rows_last":500,"rows_between":2000,"halvings":0,"cell_chars":16384,"cell_head_chars":4096},"cells_cut":0,"cells_raw":0,"read":"whole","date_system":"1900"}

{"sheet":"Cover Sheet","index":0,"n_rows":35,"n_cols":19,"rows_kept":35,"cut":false,"hidden":false,"merged":[[1,2,2,16],[27,3,27,18],[29,3,29,18],[31,3,31,18],[4,1,23,18],[25,3,25,18]]}
[]
[null,null,"Indicative Scottish Homelessness Budget Calculator "]
[]
[]
[null,"This Scottish homelessness budget tool provides a high-level estimation of the required budget at a local authority level to tackle homelessness across Scotland. The model developed allows the user to explore the current costs of homelessness services based on the latest available Green Book data (POBE) and make adjustments based on the number of HL1 homeless assessments and the types of services used as well as any other sensitivities. This model provides a comparison of the current level of funding provided to local authorities from the Scottish Government. Guidance and information is provided for each stage of the budget calculation process. There are 5 steps to using this calculator:\n\nStep 1: Choose the breakdown for the budget calculation\nStart by choosing the breakdown for the data (ie an individual local authority, rural/urban local authorities, housing option hubs, or for the whole of Scotland). \n\nStep 2: Select or input the unit costs for type of services provided\nThis step determines the service type and the annual unit costs through pre-loaded drop-down options. The user also has the option of manually adding in costs. \n\nStep 3: Determine the number of people in each service\nThe number of people in a selection of service types can be added in here using current avaiable data, or through using estimates of the percentage of people who might be in each service. This can also be used to model what the service could like in the furture. This requires a manual input of percentages which then calculates the total number of people in each service based on homelessness assessment from 2018/19 - 2020/21. \n\nStep 4: Add in any sensitivities\nThe final step is to add any sensitivities that you feel are relevant to the budget estimation which in effects produces a margin of error for the model. \n\nStep 5: Estimated change in demand\nThis steps allows the user to produce budget projections for the next 2 years, using inflation and adjusting for any changes in demand. "]
[]
[]
[]
[]
[]
[]
[]
[]
[]
[]
[]
[]
[]
[]
[]
{"$rows_left_out":16}
{"sheet":"0. Worked example","index":1,"n_rows":28,"n_cols":11,"rows_kept":28,"cut":false,"hidden":false,"merged":[[23,7,28,11],[19,1,20,1],[19,2,20,2],[19,3,20,3],[19,8,20,8],[9,5,10,5],[10,2,10,3],[4,1,4,2],[5,1,5,2],[6,1,6,2],[9,1,10,1],[9,2,9,4]]}
[]
[null,"INPUTS for Budget adjustments",null,null,null,null,null,null,"Budget estimation"]
[null,null,null,null,null,null,null,null,null,"Step 4: Sensitivity"]
[null,"Step 1: Select location",null,null,null,null,null,null,{"$f":"IF(ISBLANK($D$5), \"\", $D$5)","v":"TOTAL Scotland"},0.05]
[null,"Local authority",null,"TOTAL Scotland"]
[null,"Average annual cost per homeless assessments (2018/19-2020/21)",null,{"$f":"IF(ISBLANK($D$5), \"\",VLOOKUP($D$5,'3. Current budget data'!$B$10:$S$51,17, FALSE))","v":7613.4088480171022},null,null,null,null,"Estimated new budget by model (£) \n2018/19-2020/21","Sensitivity range"]
[null,"Total annual homeless assessments (numbers) (2018/19-2020/21)",null,{"$f":"IF(ISBLANK($D$5),\"\", VLOOKUP($D$5,'3. Current budget data'!$B$10:$T$51,18, FALSE))","v":30193.666666666672},null,null,null,null,{"$f":"IF(ISBLANK($D$5),\"\",SUM(($F$12*$D$22)+($F$13*$D$23)+($F$14*$D$24)+($F$15*$D$25)+($F$16*$D$26)+($F$17*$D$27)))","v":247573051.59299308},{"$f":"IF(SUM($I$7)=0,$I$7,_xlfn.CONCAT(TEXT(((-$J$4)+1)*$I$7,\"£#,###\"),\" - \",TEXT(($J$4+1)*$I$7,\"£#,###\")))","v":"£235,194,399 - £259,951,704"}]
[]
[null,"Step 2: Select or input unit costs",null,null,null,null,null,null,"Unit cost comparison"]
[null,"Service type","Annual Unit Costs (£)\n(see 2. Modelling data inputs for details)",null,null,"Annual Unit Costs used in model (£)",null,null,"Average POBE costs (£)\n2018/19 - 2020/21","*Estimated* unit cost by model (£)\n2018/19 - 2020/21","Difference (£)"]
[null,null,"Drop down options",null,"Manual input",null,null,null,{"$f":"IF(ISBLANK($D$5),\"\", $D$6)","v":7613.4088480171022},{"$f":"IF(SUM($D$7)=0,\"\",$I$7/$D$7)","v":8199.5027078413696},{"$f":"SUM($I$11)-SUM($J$11)","v":-586.09385982426738}]
[null,"Housing First","Support cost plus SRS rent ",{"$f":"IF(ISBLANK($C$12),0, VLOOKUP($B$12,'2. Modelling data inputs'!$B$13:$E$18,IF($C$12=\"Support cost\", \"2\", IF($C$12=\"Support cost plus SRS rent \",\"3\", IF($C$12=\"Support cost plus PRS rent \",\"4\", \"\"))),FALSE))","v":9878},null,{"$f":"IF($E$12>0,$E$12,IF($D$12>0,$D$12,$D$6))","v":9878}]
[null,"Hostel","Support cost",{"$f":"IF(ISBLANK($C$13),0, VLOOKUP($B$13,'2. Modelling data inputs'!$B$13:$E$18,IF($C$13=\"Support cost\", \"2\", IF($C$13=\"Support cost plus SRS rent \",\"3\", IF($C$13=\"Support cost plus PRS rent \",\"4\", \"\"))),FALSE))","v":12878},null,{"$f":"IF($E$13>0,$E$13,IF($D$13>0,$D$13,$D$6))","v":12878},null,null,"Budget comparison"]
[null,"High Intensity Supported Accommodation ","Support cost",{"$f":"IF(ISBLANK($C$14),0, VLOOKUP($B$14,'2. Modelling data inputs'!$B$13:$E$18,IF($C$14=\"Support cost\", \"2\", IF($C$14=\"Support cost plus SRS rent \",\"3\", IF($C$14=\"Support cost plus PRS rent \",\"4\", \"\"))),FALSE))","v":18885},null,{"$f":"IF($E$14>0,$E$14,IF($D$14>0,$D$14,$D$6))","v":18885},null,null,"Average POBE expenditure (£)\n2018/19-2020/21","Estimated new budget range by model (£)  2018/19-2020/21","Difference (£)"]
[null,"Low Intensity Accommodation Based Support","Support cost plus SRS rent ",{"$f":"IF(ISBLANK($C$15),0, VLOOKUP($B$15,'2. Modelling data inputs'!$B$13:$E$18,IF($C$15=\"Support cost\", \"2\", IF($C$15=\"Support cost plus SRS rent \",\"3\", IF($C$15=\"Support cost plus PRS rent \",\"4\", \"\"))),FALSE))","v":12160},null,{"$f":"IF($E$15>0,$E$15,IF($D$15>0,$D$15,$D$6))","v":12160},null,null,{"$f":"IF(ISBLANK($D$5),\"\",SUM($D$6*$D$7))","v":229876728.95407909},{"$f":"$J$7","v":"£235,194,399 - £259,951,704"},{"$f":"SUM($I$15)-SUM($I$7)","v":-17696322.638913989}]
[null,"Floating Support","Support cost",{"$f":"IF(ISBLANK($C$16),0, VLOOKUP($B$16,'2. Modelling data inputs'!$B$13:$E$18,IF($C$16=\"Support cost\", \"2\", IF($C$16=\"Support cost plus SRS rent \",\"3\", IF($C$16=\"Support cost plus PRS rent \",\"4\", \"\"))),FALSE))","v":3046},null,{"$f":"IF($E$16>0,$E$16,IF($D$16>0,$D$16,$D$6))","v":3046}]
[null,"Other or unspecified",null,{"$f":"$D$6","v":7613.4088480171022},null,{"$f":"IF($E$17=0,$D$17,$E$17)","v":7613.4088480171022},null,null,"Budget forecast","Estimated budget (2021/22) (£)","Estimated budget (2022/23) (£)"]
[null,null,null,null,null,null,null,null,"Adjusted for annual inflation of 2%",{"$f":"IF(SUM($I$7)=0,$J$7,_xlfn.CONCAT(TEXT(((-$J$4)+1)*$I$7*(0.02+1)*(IF(ISNUMBER($J$20),$J$20,0)+1),\"£#,###\"),\" - \",TEXT(($J$4+1)*$I$7*(0.02+1)*(IF(ISNUMBER($J$20),$J$20,0)+1),\"£#,###\")))","v":"£275,883,030 - £304,923,349"},{"$f":"IF(SUM($I$7)=0,$I$7,_xlfn.CONCAT(TEXT(((-$J$4)+1)*$I$7*(0.02+1)*(0.02+1)*(IF(ISNUMBER($J$20),$J$20,0)+1)*(IF(ISNUMBER($K$20),$K$20,0)+1),\"£#,###\"),\" - \",TEXT(($J$4+1)*$I$7*(0.02+1)*(0.02+1)*(IF(ISNUMBER($J$20),$J$20,0)+1)*(IF(ISNUMBER($K$20),$K$20,0)+1),\"£#,###\")))","v":"£295,470,725 - £326,572,907"}]
[null,"Step 3: Input users by service type"]
[null,"Service type","Estimated % of \npeople in each service","Estimated number of people annually in each service",null,null,null,null,"Step 5: Expected annual change in demand",0.15,0.05]
{"$rows_left_out":9}
{"sheet":"Sheet1","index":2,"n_rows":16,"n_cols":4,"rows_kept":16,"cut":false,"hidden":true,"merged":[[0,1,2,4]]}
[null,"Costing Tool 2"]
[]
[]
[null,null,"Projected cost:",{"$f":"SUM(D13*(1+D15))","v":{"$error":"#REF!"}}]
[]
[]
[]
[]
[null,null,"Local Authority:","Shetland Islands"]
[]
[null,null,"2020 homeless applications (HL1 returns):",{"$f":"VLOOKUP(D9,#REF!, 2, FALSE)","v":{"$error":"#REF!"}}]
[null,null,"Average cost per homeless application (2018 to 2020):",{"$f":"VLOOKUP(D9,#REF!, 3, FALSE)","v":{"$error":"#REF!"}}]
[null,null,"Housing and homelessness outturn expenditure 2020/21",{"$f":"VLOOKUP(D9,#REF!, 4, FALSE)","v":{"$error":"#REF!"}}]
[]
[null,null,"Please choose budget adjustment:",0]
[null,null,"based on incresea or decrease in demand"]

{"sheet":"1. Budget Calculator","index":3,"n_rows":28,"n_cols":11,"rows_kept":28,"cut":false,"hidden":false,"merged":[[23,7,28,11],[19,8,20,8],[4,1,4,2],[5,1,5,2],[6,1,6,2],[9,1,10,1],[9,2,9,4],[9,5,10,5],[19,3,20,3],[19,1,20,1],[10,2,10,3],[19,2,20,2]]}
[]
[null,"INPUTS for Budget adjustments",null,null,null,null,null,null,"Budget estimation"]
[null,null,null,null,null,null,null,null,null,"Step 4: Sensitivity"]
[null,"Step 1: Select location",null,null,null,null,null,null,{"$f":"IF(ISBLANK($D$5), \"\", $D$5)","v":""}]
[null,"Local authority"]
[null,"Average annual cost per homeless assessments (2018/19-2020/21)",null,{"$f":"IF(ISBLANK($D$5), \"\",VLOOKUP($D$5,'3. Current budget data'!$B$10:$S$51,17, FALSE))","v":""},null,null,null,null,"Estimated new budget by model (£) \n2018/19-2020/21","Sensitivity range"]
[null,"Average annual homeless assessments (numbers) (2018/19-2020/21)",null,{"$f":"IF(ISBLANK($D$5),\"\", VLOOKUP($D$5,'3. Current budget data'!$B$10:$T$51,18, FALSE))","v":""},null,null,null,null,{"$f":"IF(ISBLANK($D$5),\"\",SUM(($F$12*$D$22)+($F$13*$D$23)+($F$14*$D$24)+($F$15*$D$25)+($F$16*$D$26)+($F$17*$D$27)))","v":""},{"$f":"IF(SUM($I$7)=0,$I$7,_xlfn.CONCAT(TEXT(((-$J$4)+1)*$I$7,\"£#,###\"),\" - \",TEXT(($J$4+1)*$I$7,\"£#,###\")))","v":""}]
[]
[null,"Step 2: Select or input unit costs",null,null,null,null,null,null,"Unit cost comparison"]
[null,"Service type","Annual Unit Costs (£)\n(see 2. Modelling data inputs for details)",null,null,"Annual Unit Costs used in model (£)",null,null,"Average POBE costs (£)\n2018/19 - 2020/21","*Estimated* unit cost by model (£)\n2018/19 - 2020/21","Difference (£)"]
[null,null,"Drop down options",null,"Manual input",null,null,null,{"$f":"IF(ISBLANK($D$5),\"\", $D$6)","v":""},{"$f":"IF(SUM($D$7)=0,\"\",$I$7/$D$7)","v":""},{"$f":"SUM($I$11)-SUM($J$11)","v":0}]
[null,"Housing First",null,{"$f":"IF(ISBLANK($C$12),0, VLOOKUP($B$12,'2. Modelling data inputs'!$B$13:$E$18,IF($C$12=\"Support cost\", \"2\", IF($C$12=\"Support cost plus SRS rent \",\"3\", IF($C$12=\"Support cost plus PRS rent \",\"4\", \"\"))),FALSE))","v":0},null,{"$f":"IF($E$12>0,$E$12,IF($D$12>0,$D$12,$D$6))","v":""}]
[null,"Hostel",null,{"$f":"IF(ISBLANK($C$13),0, VLOOKUP($B$13,'2. Modelling data inputs'!$B$13:$E$18,IF($C$13=\"Support cost\", \"2\", IF($C$13=\"Support cost plus SRS rent \",\"3\", IF($C$13=\"Support cost plus PRS rent \",\"4\", \"\"))),FALSE))","v":0},null,{"$f":"IF($E$13>0,$E$13,IF($D$13>0,$D$13,$D$6))","v":""},null,null,"Budget comparison"]
[null,"High Intensity Supported Accommodation ",null,{"$f":"IF(ISBLANK($C$14),0, VLOOKUP($B$14,'2. Modelling data inputs'!$B$13:$E$18,IF($C$14=\"Support cost\", \"2\", IF($C$14=\"Support cost plus SRS rent \",\"3\", IF($C$14=\"Support cost plus PRS rent \",\"4\", \"\"))),FALSE))","v":0},null,{"$f":"IF($E$14>0,$E$14,IF($D$14>0,$D$14,$D$6))","v":""},null,null,"Average POBE expenditure (£)\n2018/19-2020/21","Estimated new budget range by model (£)  2018/19-2020/21","Difference (£)"]
[null,"Low Intensity Accommodation Based Support",null,{"$f":"IF(ISBLANK($C$15),0, VLOOKUP($B$15,'2. Modelling data inputs'!$B$13:$E$18,IF($C$15=\"Support cost\", \"2\", IF($C$15=\"Support cost plus SRS rent \",\"3\", IF($C$15=\"Support cost plus PRS rent \",\"4\", \"\"))),FALSE))","v":0},null,{"$f":"IF($E$15>0,$E$15,IF($D$15>0,$D$15,$D$6))","v":""},null,null,{"$f":"IF(ISBLANK($D$5),\"\",SUM($D$6*$D$7))","v":""},{"$f":"$J$7","v":""},{"$f":"SUM($I$7)-SUM($I$15)","v":0}]
[null,"Floating Support",null,{"$f":"IF(ISBLANK($C$16),0, VLOOKUP($B$16,'2. Modelling data inputs'!$B$13:$E$18,IF($C$16=\"Support cost\", \"2\", IF($C$16=\"Support cost plus SRS rent \",\"3\", IF($C$16=\"Support cost plus PRS rent \",\"4\", \"\"))),FALSE))","v":0},null,{"$f":"IF($E$16>0,$E$16,IF(ISNUMBER($D$16),$D$16,$D$6))","v":0}]
[null,"Other or unspecified",null,{"$f":"$D$6","v":""},null,{"$f":"IF($E$17=0,$D$17,$E$17)","v":""},null,null,"Budget forecast","Estimated budget (2021/22) (£)","Estimated budget (2022/23) (£)"]
[null,null,null,null,null,null,null,null,"Adjusted for annual inflation of 2%",{"$f":"IF(SUM($I$7)=0,$J$7,_xlfn.CONCAT(TEXT(((-$J$4)+1)*$I$7*(0.02+1)*(IF(ISNUMBER($J$20),$J$20,0)+1),\"£#,###\"),\" - \",TEXT(($J$4+1)*$I$7*(0.02+1)*(IF(ISNUMBER($J$20),$J$20,0)+1),\"£#,###\")))","v":""},{"$f":"IF(SUM($I$7)=0,$I$7,_xlfn.CONCAT(TEXT(((-$J$4)+1)*$I$7*(0.02+1)*(0.02+1)*(IF(ISNUMBER($J$20),$J$20,0)+1)*(IF(ISNUMBER($K$20),$K$20,0)+1),\"£#,###\"),\" - \",TEXT(($J$4+1)*$I$7*(0.02+1)*(0.02+1)*(IF(ISNUMBER($J$20),$J$20,0)+1)*(IF(ISNUMBER($K$20),$K$20,0)+1),\"£#,###\")))","v":""}]
[null,"Step 3: Input users by service type"]
[null,"Service type","Estimated % of \npeople in each service","Estimated number of people annually in each service",null,null,null,null,"Step 5: Expected annual change in demand"]
{"$rows_left_out":9}
{"sheet":"2. Modelling data inputs","index":4,"n_rows":18,"n_cols":8,"rows_kept":18,"cut":false,"hidden":false,"merged":[[1,1,2,7],[5,6,5,7],[6,6,6,7],[7,6,7,7],[11,1,11,7],[4,1,4,7],[5,2,5,4],[6,2,6,4],[7,2,7,4],[8,2,8,4],[9,2,9,4],[8,6,8,7],[9,6,9,7]]}
[]
[null,"The data for modelling and budget estimation"]
[]
[]
[null,"Scottish Local Authority Unit Costs"]
[null,null,"Calculation",null,null,"Data Source","Data Source Link"]
[null,"2018/19","Total number of homeless applications (HL1 returns) across Scotland in 2018/19",null,null,"Scottish Government: Homelessness in Scotland: 2019 to 2020 (Tables (August 2020))","https://www.gov.scot/publications/homelessness-scotland-2019-2020/"]
[null,"2019/20","Total number of homeless applications (HL1 returns) across Scotland in 2019/20",null,null,"Scottish Government: Homelessness in Scotland: 2019 to 2020 (Tables (August 2020))","https://www.gov.scot/publications/homelessness-scotland-2019-2020/"]
[null,"2020/21","Total number of homeless applications (HL1 returns) across Scotland in 2020/21",null,null,"Scottish Government - Grant Aided Expenditure (Green Book 2020-21) ","https://www.gov.scot/binaries/content/documents/govscot/publications/statistics/2019/03/grant-aided-expenditure/documents/2020-21/green-book-2020-21/green-book-2020-21/govscot%3Adocument/Green%2BBook%2B2020-21.pdf"]
[null,"Overall Unit Cost","Average annual unit cost of homelessness support and services per individual. Estimated by taking an average across all 32 Scottish Local Authorities (excluding Inverclyde as an outlier) and averaged across the last three years (2018, 2019, 2020)",null,null,"Scottish Government - Local government 2019-2020 provisional outturn and 2020-2021 budget estimates – revenue (Provisional Outturn and Budget Estimates (POBE) Workbook 2020; Local government revenue expenditure and financing 2018-2019: provisional outturn and budget estimates (POBE 2019: publication workbook)","https://www.gov.scot/publications/local-government-2019-20-provisional-outturn-2020-21-budget-estimates-revenue/; https://www.gov.scot/publications/local-government-revenue-expenditure-financing-2018-19-provisional-outturn-2019-20-budget-estimates/pages/4/"]
[]
[null,"Element approach - unit costs for different services"]
[null,"Service type ","Support cost","Support cost plus SRS rent ","Support cost plus PRS rent ","Data Source","Data Source Link ","Adjustments Made"]
[null,"Housing First",4296,9878,9592,"Homeless Link, March 2019, The cost effectiveness of Housing First in England ","https://hfe.homeless.org.uk/sites/default/files/attachments/The%20cost%20effectiveness%20of%20Housing%20First%20in%20England_March%202019_0.pdf","Support cost adjusted for inflation to October 2020; SRS/PRS rent adjusted for inflation to October 2020"]
[null,"Hostel",12878,18460,18174,"Homeless Link, March 2019, The cost effectiveness of Housing First in England ","https://hfe.homeless.org.uk/sites/default/files/attachments/The%20cost%20effectiveness%20of%20Housing%20First%20in%20England_March%202019_0.pdf","Support cost adjusted for inflation to October 2020; SRS/PRS rent adjusted for inflation to October 2020"]
[null,"High intensity supported accommodation ",18885,24467,24181,"Homeless Link, March 2019, The cost effectiveness of Housing First in England ","https://hfe.homeless.org.uk/sites/default/files/attachments/The%20cost%20effectiveness%20of%20Housing%20First%20in%20England_March%202019_0.pdf","Support cost adjusted for inflation to October 2020; SRS/PRS rent adjusted for inflation to October 2020"]
[null,"Low Intensity Accommodation Based Support",6578,12160,11874,"Crisis, July 2015, At what cost?\nAn estimation of the financial costs of single homelessness in the UK","https://www.crisis.org.uk/media/20677/crisis_at_what_cost_2015.pdf","Weekly support cost adjusted to yearly; cost adjusted for inflation to October 2020; SRS/PRS rent adjusted for inflation to October 2020"]
[null,"Floating support",3046,"N/A","N/A","Crisis, July 2015, At what cost?\nAn estimation of the financial costs of single homelessness in the UK","https://www.crisis.org.uk/media/20677/crisis_at_what_cost_2015.pdf","Weekly support cost adjusted to yearly; cost adjusted for inflation to October 2020; SRS/PRS rent adjusted for inflation to October 2020"]

{"sheet":"3. Current budget data","index":5,"n_rows":51,"n_cols":26,"rows_kept":51,"cut":false,"hidden":false,"merged":[[1,1,2,20],[8,17,8,18],[8,12,8,16],[4,1,5,10],[6,1,6,2],[6,3,6,4],[8,2,8,6],[8,7,8,11]]}
[]
[null,"The data behind current budget estimations"]
[]
[]
[null,"The model uses information from the Scottish Government's Local Government Provisional Outturn and Budget Estimates (POBE) across the last three years (2018, 2019 and 2020), in conjunction with estimates of the total number of homeless applications (HL1 returns) taken from the Scottish Government's green book on Grant Aided expenditure"]
[]
[null,"https://www.gov.scot/publications/homelessness-scotland-2019-2020/",null,"https://www.gov.scot/binaries/content/documents/govscot/publications/statistics/2019/03/grant-aided-expenditure/documents/2020-21/green-book-2020-21/green-book-2020-21/govscot%3Adocument/Green%2BBook%2B2020-21.pdf"]
[]
[null,null,"2018/19",null,null,null,null,"2019/20",null,null,null,null,"2020/21"]
[null,"Local Authority","Housing Support Services (provisional outturn)","Homelessness (provisional outturn)","Total provisional outturn","Homeless/threatened with homelessness acceptances","Unit cost","Housing Support Services (provisional outturn)","Homelessness (provisional outturn)","Total provisional outturn","Homeless/threatened with homelessness acceptances","Unit cost","Housing Support Services (budget estimate)","Homelessness (budget estimate)","Total budget","Homeless acceptances 2016/2017 - 2018/2019","Unit cost","Average unit cost 2018/19-2020/21","Average acceptances 2018/19-2020/21","Regional Hub","Rural/Urban"]
[null,"Aberdeen City",3068000,2755000,{"$f":"SUM(C11:D11)","v":5823000},1305,{"$f":"SUM(E11/F11)","v":4462.0689655172409},2897000,1586000,{"$f":"SUM(H11:I11)","v":4483000},1245,{"$f":"SUM(J11/K11)","v":3600.8032128514055},2629000,2089000,{"$f":"SUM(M11:N11)","v":4718000},1304,{"$f":"SUM(O11/P11)","v":3618.0981595092026},{"$f":"AVERAGE(G11,L11,Q11)","v":3893.6567792926166},{"$f":"AVERAGE(F11,K11,P11)","v":1284.6666666666667},"North and Islands","Urban",null,null,null,"Urban",{"$f":"SUMIF($U$11:$U$42,$Y$11,$F$11:$F$42)","v":24010}]
[null,"Aberdeenshire",668000,3692000,4360000,970,{"$f":"SUM(E12/F12)","v":4494.8453608247419},584000,2612000,{"$f":"SUM(H12:I12)","v":3196000},1060,3015.0943396226417,1060000,3276000,{"$f":"SUM(M12:N12)","v":4336000},933,{"$f":"SUM(O12/P12)","v":4647.3740621650586},{"$f":"AVERAGE(G12,L12,Q12)","v":4052.4379208708137},{"$f":"AVERAGE(F12,K12,P12)","v":987.66666666666663},"North and Islands","Rural",null,null,null,"Rural",{"$f":"SUMIF($U$11:$U$42,$Y$12,$F$11:$F$42)","v":5890}]
[null,"Angus",1196000,1421000,2617000,590,4435.593220338983,1146000,1283000,2429000,500,4858,1253000,1307000,2560000,606,4224.4224422442248,4506.0052208610687,565.33333333333337,"Tayside, Fife and Central","Urban",null,null,null,null,{"$f":"SUM(Z11:Z12)","v":29900}]
[null,"Argyll & Bute",1055000,1583000,2638000,350,7537.1428571428569,1057000,1542000,2599000,340,7644.1176470588234,1058000,1556000,2614000,392,6668.3673469387759,7283.2092837134851,360.66666666666669,"Tayside, Fife and Central","Rural"]
[null,"Clackmannanshire",82000,-321000,-239000,470,-508.51063829787233,166000,-906000,-740000,425,-1741.1764705882354,266000,-393000,-127000,444,-286.03603603603602,-845.24104830738122,446.33333333333331,"Tayside, Fife and Central","Urban"]
[null,"Dumfries & Galloway",3857000,2133000,5990000,715,8377.6223776223778,3285000,2723000,6008000,730,8230.1369863013697,3366000,2644000,6010000,657,9147.6407914764077,8585.1333851333839,700.66666666666663,"Ayrshire and South","Rural"]
[null,"Dundee City",1481000,1882000,3363000,1020,3297.0588235294117,1404000,2965000,4369000,1020,4283.333333333333,1421000,2909000,4330000,995,4351.7587939698496,3977.3836502775316,1011.6666666666666,"Tayside, Fife and Central","Urban"]
[null,"East Ayrshire",6447000,988000,7435000,625,11896,6514000,891000,7405000,720,10284.722222222223,6514000,1181000,7695000,529,14546.313799621928,12242.345340614716,624.66666666666663,"Ayrshire and South","Urban"]
[null,"East Dunbartonshire",75000,976000,1051000,315,3336.5079365079364,71000,1248000,1319000,350,3768.5714285714284,71000,830000,901000,353,2552.4079320113315,3219.1624323635656,339.33333333333331,"West","Urban"]
[null,"East Lothian",865000,1666000,2531000,660,3834.848484848485,870000,1796000,2666000,635,4198.4251968503941,897000,1886000,2783000,657,4235.9208523592088,4089.7315113526961,650.66666666666663,"Edinburgh, Lothians and Borders","Rural"]
{"$rows_left_out":32}
{"sheet":"Sensitivity data","index":6,"n_rows":27,"n_cols":2,"rows_kept":27,"cut":false,"hidden":true,"merged":[]}
[0,-1]
[0.01,-0.75]
[0.05,-0.500000000000001]
[0.1,-0.45000000000000101]
[0.15,-0.40000000000000102]
[0.2,-0.35000000000000098]
[0.25,-0.30000000000000099]
[0.3,-0.250000000000001]
[0.35,-0.20000000000000101]
[0.4,-0.15000000000000099]
[0.45,-0.100000000000001]
[0.5,-5.0000000000000898E-2]
[0.55000000000000004,-0.01]
[0.6,0]
[0.65,0.01]
[0.7,0.05]
[0.75,0.1]
[0.8,0.15]
[0.85,0.2]
[0.9,0.25]
{"$rows_left_out":7}